{"text_format":"2","workbook":"xlsx","n_sheets":17,"sheets":["Cover Sheet","RFP Summary","YSM-YM Clinical Plan","AF Summary Template","Salary Build Sheet (Clinical)","Non-Salary Build (Clinical)","Research Plan","OTC Calculation FY22 - OPTIONAL","OTC Calculation FY22 EXAMPLE","Assumptions","Contractual Calculator","I&A Calculator","Definitions ","Version Notes","Research Depository","Depository for MD","Depository1"],"not_rendered":{"charts":0,"images":1,"macros":0,"external_links":1,"defined_names":29,"comments":0,"pivot_tables":0},"unopened":[],"bounds":{"document_bytes":16777216,"sheet_cells":100000,"run_cost":"one","rows_first":2000,"rows_last":500,"rows_between":2000,"halvings":0,"cell_chars":16384,"cell_head_chars":4096},"cells_cut":0,"cells_raw":0,"read":"whole","date_system":"1900"}

{"sheet":"Cover Sheet","index":0,"n_rows":28,"n_cols":8,"rows_kept":28,"cut":false,"hidden":false,"merged":[[2,18,2,19],[3,3,3,10],[3,18,3,19],[4,4,4,5],[5,4,5,5],[8,4,10,10],[0,2,0,5],[1,7,1,8],[2,2,2,5],[2,7,2,8]]}
[null,null,"Shared Services Submission Cover Sheet",null,null,null,"Required Signatures / Attached Email Support:"]
[{"$nulls":7},"Department Chair:"]
[{"$nulls":7},"Service Line Lead:"]
[null,null,null,"Please complete the following cover sheet and include with all SSA submissions"]
[{"$nulls":4},"Department / Section:"]
[{"$nulls":4},"Submission Title:"]
[false,"New Recruit",{"$f":"IF(A7=FALSE,\" \",B7)","v":" "},null,"Description: Please describe the submission including supportive information, background,"]
[{"$nulls":5}," description of the request and relevant details (3-5 sentences)"]
[false,"Replacement",{"$f":"IF(A9=FALSE,\" \",B9)","v":" "}]
[false,"Medical Director"," "]
{"$rows_left_out":19}
{"sheet":"RFP Summary","index":1,"n_rows":47,"n_cols":8,"rows_kept":47,"cut":false,"hidden":false,"merged":[]}
[]
[]
[]
["RFP Summary","Year 1","Year 2","Year 3",null,null,null,"Notes:"]
[]
["Volume",{"$f":"'YSM-YM Clinical Plan'!C13","v":0},{"$f":"'YSM-YM Clinical Plan'!D13","v":0},{"$f":"'YSM-YM Clinical Plan'!E13","v":0},null,{"$f":"SUM(B6:D6)","v":0}]
["Revenue-generating Clinical FTE1",{"$f":"'YSM-YM Clinical Plan'!C14","v":0},{"$f":"'YSM-YM Clinical Plan'!D14","v":0},{"$f":"'YSM-YM Clinical Plan'!E14","v":0},null,{"$f":"SUM(B7:E7)","v":0}]
["# of Faculty",{"$f":"'YSM-YM Clinical Plan'!C15","v":0},{"$f":"'YSM-YM Clinical Plan'!D15","v":0},{"$f":"'YSM-YM Clinical Plan'!E15","v":0},null,{"$f":"SUM(B8:E8)","v":0}]
["Collections (Based on Full Year)",{"$f":"'YSM-YM Clinical Plan'!C16","v":0},{"$f":"'YSM-YM Clinical Plan'!D16","v":0},{"$f":"'YSM-YM Clinical Plan'!E16","v":0},null,{"$f":"SUM(B9:D9)","v":0}]
["Collections (Prorated if applicable)",{"$f":"'YSM-YM Clinical Plan'!C17","v":0},{"$f":"'YSM-YM Clinical Plan'!D17","v":0},{"$f":"'YSM-YM Clinical Plan'!E17","v":0},null,{"$f":"SUM(B10:D10)","v":0}]
{"$rows_left_out":38}
{"sheet":"YSM-YM Clinical Plan","index":2,"n_rows":87,"n_cols":9,"rows_kept":87,"cut":false,"hidden":false,"merged":[[9,6,10,6],[9,0,9,1]]}
[]
[]
[null,null,"<-----Please Select Type",null,null,null,"PW: yalebulldogs"]
[null,null,"<-----Please Select Identifying Information "]
[null,null,"<-----Please Select  Department"]
[null,null,"<-----Please Select  Department Section (if applicable)"]
[]
["Select Ramp-Up Methodology/Fiscal Year---->","FY 2024","Blank ","Blank","Blank",null,"---> please select"]
["Fiscal Year Start ---->","Full Year"]
[{"$nulls":6},"3 yr. Total"]
{"$rows_left_out":78}
{"sheet":"AF Summary Template","index":3,"n_rows":28,"n_cols":9,"rows_kept":28,"cut":false,"hidden":false,"merged":[]}
[]
[]
[]
[null,{"$f":"'YSM-YM Clinical Plan'!A3","v":0}]
[]
[null,null,{"$f":"'YSM-YM Clinical Plan'!B8","v":"FY 2024"},{"$f":"CONCATENATE(\"FY\", \" \",RIGHT(C6,4)+1)","v":"FY 2025"},{"$f":"CONCATENATE(\"FY\", \" \",RIGHT(D6,4)+1)","v":"FY 2026"},"FY 23","FY 24","3 Year Total","Comments"]
[null,"cFTE",{"$f":"'YSM-YM Clinical Plan'!C14","v":0},{"$f":"'YSM-YM Clinical Plan'!D14","v":0},{"$f":"'YSM-YM Clinical Plan'!E14","v":0},1,{"$f":"+D7","v":0}]
[null,"Volume",{"$f":"'YSM-YM Clinical Plan'!C13","v":0},{"$f":"'YSM-YM Clinical Plan'!D13","v":0},{"$f":"'YSM-YM Clinical Plan'!E13","v":0},{"$f":"'[1]YSM-YM Clinical Plan'!F14","v":0},{"$f":"'[1]YSM-YM Clinical Plan'!G14","v":1000},{"$f":"SUM(C8:E8)","v":0},{"$f":"'YSM-YM Clinical Plan'!B13","v":"wRVUs"}]
[null,"Volume as % of Benchmark"]
[]
{"$rows_left_out":19}
{"sheet":"Salary Build Sheet (Clinical)","index":4,"n_rows":48,"n_cols":53,"rows_kept":48,"cut":false,"hidden":false,"merged":[[5,19,5,32],[5,33,5,46],[6,34,7,34],[6,6,7,6],[5,5,5,18],[6,20,7,20]]}
[]
[]
[{"$nulls":6},"Assume compensation is for 1.0 FTE; formula will prorate for Clinical effort"]
[{"$nulls":6},"Salary support should be proportional to 1.0 FTE"]
[null,"Salary Build Plan"]
[null,null,null,"(impacts family leave fringe)",null,"Year One",{"$nulls":13},"Year Two",{"$nulls":13},"Year Three"]
[null,null,"Position","Clinical or","Grant","Total Clinical","Total Salary Support FTE","Full FTE",null,null,"Year One","Clinical Total","Clinical Total","Clinical Total","Clinical Total","Salary Support","Salary Support","Salary Support","Salary Support","Total Clinical","Total Salary Support FTE",null,null,null,"Year Two","Clinical Total","Clinical Total","Clinical Total","Clinical Total","Salary Support","Salary Support","Salary Support","Salary Support","Total Clinical","Total Salary Support FTE",null,null,null,"Year Three","Clinical Total","Clinical Total","Clinical Total","Clinical Total","Salary Support","Salary Support","Salary Support","Salary Support","Cumulative"]
[null,"Type of Position/Name","Description"," Non-Clinical?","Funded?","FTE (not cFTE)",null,"Compensation","Fringe","Tack-On","Total ","Comp","Fringe","Tack-On","Total","Comp","Fringe","Tack-On","Total","FTE (not cFTE)",null,"Comp.1","Fringe","Tack-On","Total ","Comp","Fringe","Tack-On","Total","Comp","Fringe","Tack-On","Total","FTE (not cFTE)",null,"Comp.1","Fringe","Tack-On","Total ","Comp","Fringe","Tack-On","Total","Comp","Fringe","Tack-On","Total","Clinica lStaff Costs"]
[null,"Faculty Staffing"]
[null,null,null,"Clinical","No",null,null,null,{"$f":"IF(D10=\"Non-Clinical\",IF($E10=\"Yes\",IF(H10>Assumptions!$D$18,(Assumptions!$D$18*Assumptions!$D$8),H10*Assumptions!$D$8),IF(H10>Assumptions!$D$18,(Assumptions!$D$18*Assumptions!$D$6)+(('Salary Build Sheet (Clinical)'!H10-Assumptions!$D$18)*Assumptions!$D$13),H10*Assumptions!$D$6)),IF($E10=\"Yes\",IF(H10>Assumptions!$D$18,(Assumptions!$D$18*Assumptions!$D$8),H10*Assumptions!$D$8),IF(H10>Assumptions!$D$18,(Assumptions!$D$18*Assumptions!$D$7)+(('Salary Build Sheet (Clinical)'!H10-Assumptions!$D$18)*Assumptions!$D$14),H10*Assumptions!$D$7)))","v":0},{"$f":"IF(E10=\"Non-Clinical\",IF($E10=\"Yes\",IF(H10>Assumptions!$D$18,(Assumptions!$D$18*0),H10*0),IF(H10>Assumptions!$D$18,(Assumptions!$D$18*(Assumptions!$D$9+Assumptions!$D$10))+(('Salary Build Sheet (Clinical)'!H10-Assumptions!$D$18)*0),H10*(Assumptions!$D$9+Assumptions!$D$10))),IF($E10=\"Yes\",IF(H10>Assumptions!$D$18,(Assumptions!$D$18*0),H10*0),IF(H10>Assumptions!$D$18,(Assumptions!$D$18*(Assumptions!$D$9+Assumptions!$D$10))+(('Salary Build Sheet (Clinical)'!H10-Assumptions!$D$18)*0),H10*(Assumptions!$D$9+Assumptions!$D$10))))","v":0},{"$f":"I10+H10+J10","v":0},{"$f":"H10*F10","v":0},{"$f":"I10*F10","v":0},{"$f":"J10*F10","v":0},{"$f":"SUM(L10:N10)","v":0},{"$f":"H10*G10","v":0},{"$f":"I10*G10","v":0},{"$f":"J10*G10","v":0},{"$f":"SUM(P10:R10)","v":0},null,null,null,{"$f":"IF(J10=\"Non-Clinical\",IF($E10=\"Yes\",IF(V10>Assumptions!$D$18,(Assumptions!$D$18*Assumptions!$D$8),V10*Assumptions!$D$8),IF(V10>Assumptions!$D$18,(Assumptions!$D$18*Assumptions!$D$6)+(('Salary Build Sheet (Clinical)'!V10-Assumptions!$D$18)*Assumptions!$D$13),V10*Assumptions!$D$6)),IF($E10=\"Yes\",IF(V10>Assumptions!$D$18,(Assumptions!$D$18*Assumptions!$D$8),V10*Assumptions!$D$8),IF(V10>Assumptions!$D$18,(Assumptions!$D$18*Assumptions!$D$7)+(('Salary Build Sheet (Clinical)'!V10-Assumptions!$D$18)*Assumptions!$D$14),V10*Assumptions!$D$7)))","v":0},{"$f":"IF(K10=\"Non-Clinical\",IF($E10=\"Yes\",IF(V10>Assumptions!$D$18,(Assumptions!$D$18*0),V10*0),IF(V10>Assumptions!$D$18,(Assumptions!$D$18*(Assumptions!$D$9+Assumptions!$D$10))+(('Salary Build Sheet (Clinical)'!V10-Assumptions!$D$18)*0),V10*(Assumptions!$D$9+Assumptions!$D$10))),IF($E10=\"Yes\",IF(V10>Assumptions!$D$18,(Assumptions!$D$18*0),V10*0),IF(V10>Assumptions!$D$18,(Assumptions!$D$18*(Assumptions!$D$9+Assumptions!$D$10))+(('Salary Build Sheet (Clinical)'!V10-Assumptions!$D$18)*0),V10*(Assumptions!$D$9+Assumptions!$D$10))))","v":0},{"$f":"W10+V10+X10","v":0},{"$f":"V10*T10","v":0},{"$f":"W10*T10","v":0},{"$f":"X10*T10","v":0},{"$f":"SUM(Z10:AB10)","v":0},{"$f":"V10*U10","v":0},{"$f":"W10*U10","v":0},{"$f":"X10*U10","v":0},{"$f":"SUM(AD10:AF10)","v":0},null,null,null,{"$f":"IF(X10=\"Non-Clinical\",IF($E10=\"Yes\",IF(AJ10>Assumptions!$D$18,(Assumptions!$D$18*Assumptions!$D$8),AJ10*Assumptions!$D$8),IF(AJ10>Assumptions!$D$18,(Assumptions!$D$18*Assumptions!$D$6)+(('Salary Build Sheet (Clinical)'!AJ10-Assumptions!$D$18)*Assumptions!$D$13),AJ10*Assumptions!$D$6)),IF($E10=\"Yes\",IF(AJ10>Assumptions!$D$18,(Assumptions!$D$18*Assumptions!$D$8),AJ10*Assumptions!$D$8),IF(AJ10>Assumptions!$D$18,(Assumptions!$D$18*Assumptions!$D$7)+(('Salary Build Sheet (Clinical)'!AJ10-Assumptions!$D$18)*Assumptions!$D$14),AJ10*Assumptions!$D$7)))","v":0},{"$f":"IF(Y10=\"Non-Clinical\",IF($E10=\"Yes\",IF(AJ10>Assumptions!$D$18,(Assumptions!$D$18*0),AJ10*0),IF(AJ10>Assumptions!$D$18,(Assumptions!$D$18*(Assumptions!$D$9+Assumptions!$D$10))+(('Salary Build Sheet (Clinical)'!AJ10-Assumptions!$D$18)*0),AJ10*(Assumptions!$D$9+Assumptions!$D$10))),IF($E10=\"Yes\",IF(AJ10>Assumptions!$D$18,(Assumptions!$D$18*0),AJ10*0),IF(AJ10>Assumptions!$D$18,(Assumptions!$D$18*(Assumptions!$D$9+Assumptions!$D$10))+(('Salary Build Sheet (Clinical)'!AJ10-Assumptions!$D$18)*0),AJ10*(Assumptions!$D$9+Assumptions!$D$10))))","v":0},{"$f":"AK10+AJ10+AL10","v":0},{"$f":"AJ10*AH10","v":0},{"$f":"AK10*AH10","v":0},{"$f":"AL10*AH10","v":0},{"$f":"SUM(AN10:AP10)","v":0},{"$f":"AJ10*AI10","v":0},{"$f":"AK10*AI10","v":0},{"$f":"AL10*AI10","v":0},{"$f":"SUM(AR10:AT10)","v":0},{"$f":"AQ10+AC10+O10","v":0},null,null,{"$f":"IF(G10>0,(G10/#REF!)*H10,\" \")","v":" "},{"$f":"IF(G10>0,(G10/#REF!)*W10,\" \")","v":" "},{"$f":"SUM(AY10:AZ10)","v":0}]
{"$rows_left_out":39}
{"sheet":"Non-Salary Build (Clinical)","index":5,"n_rows":40,"n_cols":10,"rows_kept":40,"cut":false,"hidden":false,"merged":[]}
[]
[]
[]
[]
[null,"Non-Salary Build Plan"]
[]
[null,null,"Year One","Year Two","Year Three","Cumulative",null,"Non-Salary"]
[null,"Type of Position/Name","Total ","Total ","Total ","Costs",null,"Notes"]
[null,"Space/Sessions"]
[null,"Space ",null,null,null,{"$f":"SUM(C10:E10)","v":0},null,null,{"$f":"IF(#REF!>0,(#REF!/#REF!)*#REF!,\" \")","v":{"$error":"#REF!"}},{"$f":"IF(#REF!>0,(#REF!/#REF!)*#REF!,\" \")","v":{"$error":"#REF!"}}]
{"$rows_left_out":31}
{"sheet":"Research Plan","index":6,"n_rows":42,"n_cols":27,"rows_kept":42,"cut":false,"hidden":false,"merged":[[2,2,2,8],[2,10,2,16],[2,18,2,24],[40,2,40,8],[41,2,41,8]]}
[null,"Research Mission Business Plan"]
[]
[null,null,"Year 1",{"$nulls":7},"Year 2",{"$nulls":7},"Year 3"]
[null,null,"Grants &\nContracts","Gifts/\nEndowment","Dept-Funded\n(YD)","Dean-Funded\n(APS)","VA","Other\n(please specify)","Total",null,"Grants &\nContracts","Gifts/\nEndowment","Dept-Funded\n(YD)","Dean-Funded\n(APS)","VA","Other\n(please specify)","Total",null,"Grants &\nContracts","Gifts/\nEndowment","Dept-Funded\n(YD)","Dean-Funded\n(APS)","VA","Other\n(please specify)","Total",null,"Grand Total"]
[null,"Revenue:"]
[null,"Grant Directs",0,0,0,0,0,0,{"$f":"SUM(C6:H6)","v":0},null,0,0,0,0,0,0,{"$f":"SUM(K6:P6)","v":0},null,0,0,0,0,0,0,{"$f":"SUM(S6:X6)","v":0},null,{"$f":"I6+Q6+Y6","v":0}]
[null,"Grant Indirects",0,0,0,0,0,0,{"$f":"SUM(C7:H7)","v":0},null,0,0,0,0,0,0,{"$f":"SUM(K7:P7)","v":0},null,0,0,0,0,0,0,{"$f":"SUM(S7:X7)","v":0},null,{"$f":"I7+Q7+Y7","v":0}]
[{"$f":"'YSM-YM Clinical Plan'!$B$39","v":0.23080000000000001},"Clinical Drug Trials",0,0,0,0,0,0,0,null,0,0,0,0,0,0,0,null,0,0,0,0,0,0,0,null,{"$f":"I8+Q8+Y8","v":0}]
[0.12,"Spendable Gifts",0,0,0,0,0,0,0,null,0,0,0,0,0,0,0,null,0,0,0,0,0,0,0,null,0]
[null,"Endowment Income",0,0,0,0,0,0,0,null,0,0,0,0,0,0,0,null,0,0,0,0,0,0,0,null,0]
{"$rows_left_out":33}
{"sheet":"OTC Calculation FY22 - OPTIONAL","index":7,"n_rows":22,"n_cols":19,"rows_kept":22,"cut":false,"hidden":false,"merged":[[0,0,0,16],[1,0,1,7],[1,9,1,10],[1,12,2,16],[2,0,2,7],[2,9,2,10]]}
["NIH / HHS SALARY and IRS PENSION CAP - Costing Allocation Calculations "]
["Current NIH Salary Cap",{"$nulls":8},{"$f":"Assumptions!$D$21","v":212100},null,null,"Worker Costing Allocations                      (Effective Effort)"]
["Current IRS Pension Cap",{"$nulls":8},{"$f":"Assumptions!$D$18","v":330000}]
[null,"A","B","C","D (A*B)","E  (B*NIH CAP)","F                      ( (A-Pension Cap)*B)","G                      ( (A-Pension Cap)*B)","H","I","J",null,"K","L","M","N","O",null,"Y"]
["Enter Faculty Name","Actual Salary ","Intended Effort %*","Is this a NIH/HHS Grant?","Actual Salary at required effort","COA Direct Charge Salary","NIH/HHS Over the Cap Salary","PENSION - Over the Cap Salary","COA Direct Charge Fringe","Combined Over the Cap Fringe","Total Cost Sharing",null,"COA Direct Charge","NIH Cap Cost Share","Pension Cap Cost Share (Ledger:71013)","Total","Variance",null,"N"]
["Enter Awards or Grants here",0,0,null,{"$f":"B6*C6","v":0},{"$f":"IF(D6=\"Y\",$J$2*C6,E6-H6)","v":0},{"$f":"IF(D6=\"y\",E6-F6-H6,0)","v":0},{"$f":"IF(B6>=$J$3,((B6-$J$3)*(C6)),0)","v":0},{"$f":"F6*$F$17","v":0},{"$f":"(H6*$H$17)+(G6*$G$17)","v":0},{"$f":"G6+H6+J6","v":0},null,{"$f":"IFERROR(F6/B6,0)","v":0},{"$f":"IFERROR(G6/B6,0)","v":0},{"$f":"IFERROR(H6/B6,0)","v":0},{"$f":"SUM(M6:O6)","v":0},{"$f":"C6-P6","v":0}]
[null,{"$f":"B6","v":0},0,null,0,0,0,0,0,0,{"$f":"G7+H7+J7","v":0},null,0,0,0,0,0]
[null,{"$f":"B7","v":0},0,null,0,0,0,0,0,0,0,null,0,0,0,0,0]
[null,0,0,null,0,0,0,0,0,0,0,null,0,0,0,0,0]
[null,0,0,null,0,0,0,0,0,0,0,null,0,0,0,0,0]
{"$rows_left_out":13}
{"sheet":"OTC Calculation FY22 EXAMPLE","index":8,"n_rows":22,"n_cols":19,"rows_kept":22,"cut":false,"hidden":false,"merged":[[0,0,0,16],[1,0,1,7],[1,9,1,10],[1,12,2,16],[2,0,2,7],[2,9,2,10]]}
["NIH / HHS SALARY and IRS PENSION CAP - Costing Allocation Calculations "]
["Current NIH Salary Cap",{"$nulls":8},{"$f":"Assumptions!$D$21","v":212100},null,null,"Worker Costing Allocations                      (Effective Effort)"]
["Current IRS Pension Cap",{"$nulls":8},{"$f":"Assumptions!$D$18","v":330000}]
[null,"A","B","C","D (A*B)","E  (B*NIH CAP)","F                      ( (A-Pension Cap)*B)","G                      ( (A-Pension Cap)*B)","H","I","J",null,"K","L","M","N","O",null,"Y"]
["Enter Faculty Name","Actual Salary ","Intended Effort %*","Is this a NIH/HHS Grant?","Actual Salary at required effort","COA Direct Charge Salary","NIH/HHS Over the Cap Salary","PENSION - Over the Cap Salary","COA Direct Charge Fringe","Combined Over the Cap Fringe","Total Cost Sharing",null,"COA Direct Charge","NIH Cap Cost Share","Pension Cap Cost Share (Ledger:71013)","Total","Variance",null,"N"]
["Enter Awards or Grants here",1000000,0.1,"Y",{"$f":"B6*C6","v":100000},{"$f":"IF(D6=\"Y\",$J$2*C6,E6-H6)","v":21210},{"$f":"IF(D6=\"y\",E6-F6-H6,0)","v":11790},{"$f":"IF(B6>=$J$3,((B6-$J$3)*(C6)),0)","v":67000},{"$f":"F6*$F$17","v":6511.47},{"$f":"(H6*$H$17)+(G6*$G$17)","v":5053.8500000000004},{"$f":"G6+H6+J6","v":83843.850000000006},null,{"$f":"IFERROR(F6/B6,0)","v":2.121E-2},{"$f":"IFERROR(G6/B6,0)","v":1.179E-2},{"$f":"IFERROR(H6/B6,0)","v":6.7000000000000004E-2},{"$f":"SUM(M6:O6)","v":0.1},{"$f":"C6-P6","v":0}]
[null,{"$f":"B6","v":1000000},0.1,"N",100000,33000,0,67000,10131,1340,{"$f":"G7+H7+J7","v":68340},null,3.3000000000000002E-2,0,6.7000000000000004E-2,0.1,0]
[null,{"$f":"B7","v":1000000},0.15,"Y",150000,31815,17685,100500,9767.2049999999999,7580.7749999999996,125765.77499999999,null,3.1815000000000003E-2,1.7684999999999999E-2,0.10050000000000001,0.15000000000000002,0]
[null,1000000,0.16,"N",160000,52800,0,107200,16209.6,2144,109344,null,5.28E-2,0,0.1072,0.16,0]
[null,1000000,0.09,"N",90000,29700,0,60300,9117.9,1206,61506,null,2.9700000000000001E-2,0,6.0299999999999999E-2,0.09,0]
{"$rows_left_out":13}
{"sheet":"Assumptions","index":9,"n_rows":26,"n_cols":5,"rows_kept":26,"cut":false,"hidden":false,"merged":[]}
[]
[null,"Assumptions Impacting YSM-YM Business Plan"]
[null,"* Changing the inputs will impact the plan sheet and salary build tab."]
[]
[null,"Fringe"]
[null,null,"M&P - Non-Clinical Faculty",0.315,"FY 2024 Rate"]
[null,null,"Clinical Faculty",0.315,"FY 2024 Rate"]
[null,null,"M&P/Faculty - Grants",0.307,"FY 2024 Rate"]
[null,null,"Tack-On & Sabaatical Assessment",{"$f":"0.086+0.03","v":0.11599999999999999},"FY 2024 Rate"]
[null,null,"Child Rearing Assessment",1.2E-2,"FY 2024 Rate"]
{"$rows_left_out":17}
{"sheet":"Contractual Calculator","index":10,"n_rows":13,"n_cols":8,"rows_kept":13,"cut":false,"hidden":false,"merged":[[3,2,3,4]]}
[]
[{"$nulls":6},"Department"]
[{"$nulls":6},"Gross-Up?"]
[null,null,"YNHHS and Non-Affiliated Hospital Contract Calculator",null,null,null,"No"]
[]
[null,null,null,"Rate","Year 1 ","Year 2","Year 3"]
[null,null,"Base Contract Amount",null,0,0,0]
[null,null,"Department Assessment ",0,{"$f":"IF(G4=\"Yes\",$E$7/(1-$D$8)-$E$7,$D$8*$E$7)","v":0},{"$f":"IF($G$4=\"Yes\",$F$7/(1-$D$8)-$F$7,$D$8*$F$7)","v":0},{"$f":"IF($G$4=\"Yes\",$G$7/(1-$D$8)-$G$7,$D$8*$G$7)","v":0}]
[null,null,"Direct Contract Amount",null,{"$f":"E8+E7","v":0},{"$f":"F8+F7","v":0},{"$f":"G8+G7","v":0}]
[null,null,"YSM/YM Assessment",0.11700000000000001,{"$f":"E9/(1-D10)-$E$9","v":0},{"$f":"F9/(1-D10)-$F$9","v":0},{"$f":"G9/(1-D10)-$G$9","v":0},"Please update to 15% if for non-affiliated"]
{"$rows_left_out":4}
{"sheet":"I&A Calculator","index":11,"n_rows":30,"n_cols":9,"rows_kept":30,"cut":false,"hidden":false,"merged":[[7,6,7,7]]}
[]
[]
[]
[null,"I&A Calculator to Support Template"]
[]
[null,"Building Purchase",{"$nulls":4},"***Abatement and remediation costs cannot be capitalized. The costs will be expensed in year one (or when abated)***"]
[]
[null,null,"Principle",0,null,null,"Type of Project",null,"Term"]
[null,null,"Int Rate",4.2500000000000003E-2,null,null,"Building Purchase",null,40]
[null,null,"Term-Yrs",40,null,null,"Building Renovation",null,"15-20"]
{"$rows_left_out":21}
{"sheet":"Definitions ","index":12,"n_rows":39,"n_cols":3,"rows_kept":39,"cut":false,"hidden":false,"merged":[]}
[]
[null,"PDDO Template Definitions:"]
[]
[null,"Category","Definition"]
[]
[null,"Type"]
[null,"YNHH PDDO","A backstop from YNHH with a unique set of assessments; will populate the assessments on PDDO section at the bottom of the document."]
[null,"YNHHS PDDO","A backstop from a YNHHS entity with a unique set of assessments; will populate the assessments on PDDO section at the bottom of the document."]
[null,"Non-Affliated PDDO","A backstop from non-YNHH/YNHHS entity with a unique set of assessments; will populate the assessments on PDDO section at the bottom of the document."]
[null,"Contractual","A plan to satisfy planning for a contractual agreement. Does not impact the spreadsheet and assessments will only be calculated within the plan. "]
{"$rows_left_out":30}
{"sheet":"Version Notes","index":13,"n_rows":99,"n_cols":3,"rows_kept":99,"cut":false,"hidden":false,"merged":[]}
[]
[null,"Version Notes:"]
[]
[null,1.1000000000000001,"Fixed formula double counting incentive compensation"]
[]
[null,1.2,"Fixed ongoing versus on-time incentive compensation"]
[]
[null,1.3,"Broke out salary build sheet by year (removed inflationary components)"]
[]
[null,null,"Added non-salary build sheet"]
{"$rows_left_out":90}
{"sheet":"Research Depository","index":14,"n_rows":16,"n_cols":7,"rows_kept":16,"cut":false,"hidden":true,"merged":[]}
[]
[]
[null,null,"On-Campus",null,"NIH Salary Cap",null,"Yes"]
[null,null,"On-Campus Department of Defense",null,"Custom Cap",null,"No"]
[null,null,"Off Campus",null,"No Cap",null,"Subaward Cap"]
[null,null,"CMHC",null,null,null,"Custom Cap"]
[null,null,"VA"]
[null,null,"Other Federally Sponsored Activities - On Campus"]
[null,null,"Other Federally Sponsored Activities - Off Campus"]
[null,null,"Private < $10K"]
{"$rows_left_out":7}
{"sheet":"Depository for MD","index":15,"n_rows":94,"n_cols":12,"rows_kept":94,"cut":false,"hidden":true,"merged":[]}
[]
[null,"Rank","CLINICAL SCIENCE - TOTAL ALL DEPARTMENTS/SPECIALTIES",{"$nulls":6},"25th",null,"Clinical"]
[null,"Instructor","Total Anesthesiology",{"$nulls":6},"Median",null,"Non-Clinical"]
[null,"Assistant Professor","Anesthesiology: General",{"$nulls":6},"75th"]
[null,"Associate Professor","Anesthesiology: Pain Management",{"$nulls":6},"Mean"]
[null,"Professor","Anesthesiology: Pediatric"]
[null,"Section Chief","Total Dermatology"]
[null,"Chair","Dermatology (excluding Mohs Surgery)"]
[null,"Medical Director","Dermatology: Mohs Surgery"]
[null,null,"Total Family Medicine"]
{"$rows_left_out":85}
{"sheet":"Depository1","index":16,"n_rows":83,"n_cols":25,"rows_kept":83,"cut":false,"hidden":true,"merged":[]}
[]
[]
[]
[{"$nulls":21},"Yes"]
[null,"60%/85%/100%","YNHH PDDO",null,"Replacement",null,null,"Anesthesiology","Administration",null,null,null,"Start in Q1",12,null,"wRVUs",{"$nulls":5},"No"]
[null,"50%/75%/100%","YNHHS PDDO",null,"Acquisition",null,null,"Comprehensive Cancer Center","Aids",{"$f":"CONCATENATE(\"Internal Medicine\",\" - \",I5)","v":"Internal Medicine - Administration"},null,null,"Start in Q2",9,null,"UHC RVUs"]
[null,"No Ramp Up","Non-Affiliated PDDO",null,"New Hire - Organic",null,null,"Child Study Center","Cardiology","Internal Medicine - Aids",null,null,"Start in Q3",6,null,"Units",{"$nulls":8},"Yes"]
[null,null,"Contractual",null,"New Program (not acquired)",null,null,"Dermatology","Clinical Affairs","Internal Medicine - Cardiology",null,null,"Start in Q4",3,null,"Time Units",{"$nulls":8},"No"]
[{"$nulls":4},"N/A",null,null,"Emergency Medicine","Clinical Scholars","Internal Medicine - Clinical Affairs",null,null,"Full Year",12,null,"Visits"]
[{"$nulls":7},"Genetics","Digestive Diseases","Internal Medicine - Clinical Scholars",null,null,"Start in July",12,null,"Cases"]
{"$rows_left_out":73}